{"text_format":"1","workbook":"xlsx","n_sheets":6,"sheets":["Eingabe","Berechnungen","Näherungsrechnung per Formel","Ausrichtung","Wetterdaten","PLZ-Zuordnung"],"not_rendered":{"charts":8,"images":8,"macros":1,"external_links":1,"defined_names":9,"comments":0,"pivot_tables":0},"unopened":[],"bounds":{"document_bytes":16777216,"sheet_cells":100000,"rows_first":2000,"rows_last":500,"rows_between":2000,"halvings":0,"cell_chars":16384,"cell_head_chars":4096},"cells_cut":0,"cells_raw":0,"read":"whole","date_system":"1900"}

{"sheet":"Eingabe","index":0,"n_rows":328,"n_cols":63,"rows_kept":328,"cut":false,"hidden":false,"merged":[[4,8,6,15],[10,6,10,7],[249,20,249,21],[249,22,249,23],[13,5,15,7],[13,11,15,12],[20,11,20,12],[22,11,22,12],[24,9,24,15],[25,9,25,15]]}
[]
[null,null,"Dimensionierung und Wirtschaftlichkeit einer PV-Anlage",null,null,null,null,null,null,null,null,"2016-09-26","Version 1.1"]
[null,null,"Allgemeine Erläuterungen"]
[]
[null,null,123,"Eingabefeld - unbeding ausfüllen",null,null,null,null,"Dieses Berechnungstool dimensioniert PV Anlagen in Kombination mit Wärmepumpen. Auf Basis wirtschaftlicher Überlegungen wird der Eigenverbrauch optimiert. Die empfohlene Anlagengröße [kWp] kann manuell variiert werden, und somit auch die Wirtschaftlichkeit von größeren Anlagen dargestellt werden."]
[null,null,123,"vorgeschlagener Wert, kann manuell überschrieben werden"]
[null,null,123,"Ergebnis"]
[]
[null,null,"Standortbezogene Daten"]
[]
[null,null,"Postleitzahl:",1130,null,"Position der Anlage","Gebäudeintegriert",null,null,null,null,null,null,"Einstrahlung (horizontale Fläche):",{"$f":"Wetterdaten!L5","v":1084},"kWh/m²a"]
[null,null,"Ort des Gebäudes:",{"$f":"'PLZ-Zuordnung'!J5","v":"Wien"},null,null,null,null,null,null,null,null,null,"Einstrahlung nach Angabe der Ausrichtung:",{"$f":"Ausrichtung!H51","v":1275.294117647059},"kWh/m²a"]
[]
[null,null,"Ausrichtung:",null,null,"Die Angabe der Ausrichtung der Anlage erfolgt von Osten nach Westen von -90° bis +90° (zB.: -45° = SO)",null,null,"Aufstellung:",null,null,"Die Angabe zur Neigung der Anlage erfolgt von 0° bis 90° (z.B.: 90° = Fassadenanlage)",null,"Randbedingungen:"]
[null,null,null,null,null,null,null,null,null,null,null,null,null,"Es kommt zu keiner Verschattung der Anlage!"]
{"$rows_left_out":314}
{"sheet":"Berechnungen","index":1,"n_rows":84,"n_cols":31,"rows_kept":84,"cut":false,"hidden":true,"merged":[[0,2,0,3]]}
[]
["empfohlene Größe",null,null,null,null,null,null,null,null,null,null,null,null,null,null,null,"gewählte Größe",null,null,null,null,"Erlös aus verkauftem, nicht selbst konsumiertem Strom"]
["Jahre","Vergütung","Energieertrag","Energieerlös","Ersparnis ","Erlös","Ausgaben","Tilgung","Zinsen","Tilg.+Zinsen","Cash Flow","Barwerte","Kapitalwert","Zeit",null,null,"Jahre","Vergütung","Energieertrag","Energieerlös","Ersparnis ","Erlös","Ausgaben","Tilgung","Zinsen","Tilg.+Zinsen","Cash Flow","Barwerte","Kapitalwert","Zeit"]
[null,"[€/kWh]","[kWh]","[€]","EUR","EUR","[€]","[€]","[€]","[€]","[€]","[€]","[€]",null,null,null,null,"[€/kWh]","[kWh]","[€]","EUR","EUR","[€]","[€]","[€]","[€]","[€]","[€]","[€]"]
[0,null,null,null,null,null,{"$f":"F63*Eingabe!G36","v":2700},null,null,{"$f":"H5+I5","v":0},{"$f":"D5-G5-J5","v":-2700},{"$f":"K5/(1+Eingabe!N$37)^A5","v":-2700},{"$f":"L5","v":-2700},{"$f":"IF(M5<0,O5,0)","v":1},1,null,0,null,null,null,null,null,{"$f":"Eingabe!G34*Eingabe!G36","v":2700},null,null,{"$f":"X5+Y5","v":0},{"$f":"T5-W5-Z5","v":-2700},{"$f":"AA5/(1+Eingabe!N$37)^Q5","v":-2700},{"$f":"AB5","v":-2700},{"$f":"IF(AC5<0,AE5,0)","v":1},1]
[1,{"$f":"Eingabe!N$30/100*(1+Eingabe!N$36)^A5","v":7.0000000000000007E-2},{"$f":"Eingabe!$G$63/$F$38*$F$39*1/(1+Eingabe!N$33)^A5","v":1190.0024470588237},{"$f":"+E6+F6","v":221.03611311237199},{"$f":"Eingabe!$N$29/100*(1+Eingabe!$N$36)^A6*C6*Berechnungen!$F$45","v":209.68755321584987},{"$f":"B6*C6*(1-$F$45)","v":11.348559896522115},{"$f":"$F$61*(Eingabe!N$32)*(1+(Eingabe!N$35))^Berechnungen!A5","v":10.8},{"$f":"+X6/$F$38*$F$39","v":0},{"$f":"+Y6/$F$38*$F$39","v":0},0,210.23611311237198,{"$f":"K6/(1+Eingabe!N$37)^A6","v":206.11383638467842},{"$f":"M5+L6","v":-2493.8861636153215},2,2,null,1,{"$f":"Eingabe!N$30/100*(1+Eingabe!N$36)^Q5","v":7.0000000000000007E-2},{"$f":"Eingabe!$G$63*1/(1+Eingabe!N$33)^Q5","v":1190.0024470588237},{"$f":"+U6+V6","v":221.03611311237199},{"$f":"Eingabe!$N$29/100*(1+Eingabe!$N$36)^Q6*S6*$G$45","v":209.68755321584987},{"$f":"R6*S6*(1-$G$45)","v":11.348559896522115},{"$f":"Eingabe!G$32*(Eingabe!N$32)*(1+(Eingabe!N$35))^Berechnungen!Q5","v":10.8},{"$f":"IF(AND(Eingabe!$I$36<=Berechnungen!Q6,(Eingabe!$I$36+Eingabe!$I$37)>Q6),(Eingabe!$G$34*(1-Eingabe!$G$36))/Eingabe!$I$37,0)","v":0},{"$f":"((Eingabe!$G$34*(1-Eingabe!$G$36))-SUM($X$5:X5))*Eingabe!$H$36","v":0},0,210.23611311237198,{"$f":"AA6/(1+Eingabe!N$37)^Q6","v":206.11383638467842},{"$f":"AC5+AB6","v":-2493.8861636153215},{"$f":"IF(AC6<0,AE6,0)","v":2},2]
[2,{"$f":"Eingabe!N$30/100*(1+Eingabe!N$36)^A6","v":7.1400000000000005E-2},{"$f":"Eingabe!$G$63/$F$38*$F$39*1/(1+Eingabe!N$33)^A6","v":1184.0820368744517},224.33515957673578,{"$f":"Eingabe!$N$29/100*(1+Eingabe!$N$36)^A7*C7*Berechnungen!$F$45","v":212.8172181892208},{"$f":"B7*C7*(1-$F$45)","v":11.517941387514986},{"$f":"$F$61*(Eingabe!N$32)*(1+(Eingabe!N$35))^Berechnungen!A6","v":11.016000000000002},{"$f":"+X7/$F$38*$F$39","v":0},{"$f":"+Y7/$F$38*$F$39","v":0},0,213.31915957673579,{"$f":"K7/(1+Eingabe!N$37)^A7","v":205.03571662508244},-2288.8504469902391,3,3,null,2,{"$f":"Eingabe!N$30/100*(1+Eingabe!N$36)^Q6","v":7.1400000000000005E-2},{"$f":"Eingabe!$G$63*1/(1+Eingabe!N$33)^Q6","v":1184.0820368744517},{"$f":"+U7+V7","v":224.33515957673578},{"$f":"Eingabe!$N$29/100*(1+Eingabe!$N$36)^Q7*S7*$G$45","v":212.8172181892208},{"$f":"R7*S7*(1-$G$45)","v":11.517941387514986},{"$f":"Eingabe!G$32*(Eingabe!N$32)*(1+(Eingabe!N$35))^Berechnungen!Q6","v":11.016000000000002},{"$f":"IF(AND(Eingabe!$I$36<=Berechnungen!Q7,(Eingabe!$I$36+Eingabe!$I$37)>Q7),(Eingabe!$G$34*(1-Eingabe!$G$36))/Eingabe!$I$37,0)","v":0},{"$f":"((Eingabe!$G$34*(1-Eingabe!$G$36))-SUM($X$5:X6))*Eingabe!$H$36","v":0},0,213.31915957673579,{"$f":"AA7/(1+Eingabe!N$37)^Q7","v":205.03571662508244},{"$f":"AC6+AB7","v":-2288.8504469902391},{"$f":"IF(AC7<0,AE7,0)","v":3},3]
[3,{"$f":"Eingabe!N$30/100*(1+Eingabe!N$36)^A7","v":7.2828000000000004E-2},{"$f":"Eingabe!$G$63/$F$38*$F$39*1/(1+Eingabe!N$33)^A7","v":1178.1910814671162},227.68344554056767,{"$f":"Eingabe!$N$29/100*(1+Eingabe!$N$36)^A8*C8*Berechnungen!$F$45","v":215.99359458010471},11.689850960462971,{"$f":"$F$61*(Eingabe!N$32)*(1+(Eingabe!N$35))^Berechnungen!A7","v":11.236320000000001},0,0,0,216.44712554056767,{"$f":"K8/(1+Eingabe!N$37)^A8","v":203.96296064538495},-2084.8874863448541,4,4,null,3,{"$f":"Eingabe!N$30/100*(1+Eingabe!N$36)^Q7","v":7.2828000000000004E-2},{"$f":"Eingabe!$G$63*1/(1+Eingabe!N$33)^Q7","v":1178.1910814671162},227.68344554056767,{"$f":"Eingabe!$N$29/100*(1+Eingabe!$N$36)^Q8*S8*$G$45","v":215.99359458010471},11.689850960462971,{"$f":"Eingabe!G$32*(Eingabe!N$32)*(1+(Eingabe!N$35))^Berechnungen!Q7","v":11.236320000000001},{"$f":"IF(AND(Eingabe!$I$36<=Berechnungen!Q8,(Eingabe!$I$36+Eingabe!$I$37)>Q8),(Eingabe!$G$34*(1-Eingabe!$G$36))/Eingabe!$I$37,0)","v":0},{"$f":"((Eingabe!$G$34*(1-Eingabe!$G$36))-SUM($X$5:X7))*Eingabe!$H$36","v":0},0,216.44712554056767,{"$f":"AA8/(1+Eingabe!N$37)^Q8","v":203.96296064538495},{"$f":"AC7+AB8","v":-2084.8874863448541},4,4]
[4,{"$f":"Eingabe!N$30/100*(1+Eingabe!N$36)^A8","v":7.4284559999999999E-2},{"$f":"Eingabe!$G$63/$F$38*$F$39*1/(1+Eingabe!N$33)^A8","v":1172.3294342956381},231.08170592177021,{"$f":"Eingabe!$N$29/100*(1+Eingabe!$N$36)^A9*C9*Berechnungen!$F$45","v":219.21737957383763},11.864326347932566,{"$f":"$F$61*(Eingabe!N$32)*(1+(Eingabe!N$35))^Berechnungen!A8","v":11.461046400000001},0,0,0,219.62065952177022,{"$f":"K9/(1+Eingabe!N$37)^A9","v":202.89554176011384},-1881.9919445847402,5,5,null,4,{"$f":"Eingabe!N$30/100*(1+Eingabe!N$36)^Q8","v":7.4284559999999999E-2},{"$f":"Eingabe!$G$63*1/(1+Eingabe!N$33)^Q8","v":1172.3294342956381},231.08170592177021,{"$f":"Eingabe!$N$29/100*(1+Eingabe!$N$36)^Q9*S9*$G$45","v":219.21737957383763},11.864326347932566,{"$f":"Eingabe!G$32*(Eingabe!N$32)*(1+(Eingabe!N$35))^Berechnungen!Q8","v":11.461046400000001},{"$f":"IF(AND(Eingabe!$I$36<=Berechnungen!Q9,(Eingabe!$I$36+Eingabe!$I$37)>Q9),(Eingabe!$G$34*(1-Eingabe!$G$36))/Eingabe!$I$37,0)","v":0},{"$f":"((Eingabe!$G$34*(1-Eingabe!$G$36))-SUM($X$5:X8))*Eingabe!$H$36","v":0},0,219.62065952177022,{"$f":"AA9/(1+Eingabe!N$37)^Q9","v":202.89554176011384},{"$f":"AC8+AB9","v":-1881.9919445847402},5,5]
[5,{"$f":"Eingabe!N$30/100*(1+Eingabe!N$36)^A9","v":7.5770251199999999E-2},{"$f":"Eingabe!$G$63/$F$38*$F$39*1/(1+Eingabe!N$33)^A9","v":1166.496949547899},234.53068660716986,{"$f":"Eingabe!$N$29/100*(1+Eingabe!$N$36)^A10*C10*Berechnungen!$F$45","v":222.48928076150693},12.04140584566291,{"$f":"$F$61*(Eingabe!N$32)*(1+(Eingabe!N$35))^Berechnungen!A9","v":11.690267328000001},0,0,0,222.84041927916985,{"$f":"K10/(1+Eingabe!N$37)^A10","v":201.8334334165605},-1680.1585111681798,6,6,null,5,{"$f":"Eingabe!N$30/100*(1+Eingabe!N$36)^Q9","v":7.5770251199999999E-2},{"$f":"Eingabe!$G$63*1/(1+Eingabe!N$33)^Q9","v":1166.496949547899},234.53068660716986,{"$f":"Eingabe!$N$29/100*(1+Eingabe!$N$36)^Q10*S10*$G$45","v":222.48928076150693},12.04140584566291,{"$f":"Eingabe!G$32*(Eingabe!N$32)*(1+(Eingabe!N$35))^Berechnungen!Q9","v":11.690267328000001},{"$f":"IF(AND(Eingabe!$I$36<=Berechnungen!Q10,(Eingabe!$I$36+Eingabe!$I$37)>Q10),(Eingabe!$G$34*(1-Eingabe!$G$36))/Eingabe!$I$37,0)","v":0},{"$f":"((Eingabe!$G$34*(1-Eingabe!$G$36))-SUM($X$5:X9))*Eingabe!$H$36","v":0},0,222.84041927916985,{"$f":"AA10/(1+Eingabe!N$37)^Q10","v":201.8334334165605},{"$f":"AC9+AB10","v":-1680.1585111681798},6,6]
[6,{"$f":"Eingabe!N$30/100*(1+Eingabe!N$36)^A10","v":7.7285656224000007E-2},{"$f":"Eingabe!$G$63/$F$38*$F$39*1/(1+Eingabe!N$33)^A10","v":1160.6934821372131},238.03114461623213,{"$f":"Eingabe!$N$29/100*(1+Eingabe!$N$36)^A11*C11*Berechnungen!$F$45","v":225.81001629526082},12.221128320971312,{"$f":"$F$61*(Eingabe!N$32)*(1+(Eingabe!N$35))^Berechnungen!A10+IF(Eingabe!M31=\"viermal\",Eingabe!N31,0)","v":11.924072674560001},0,0,0,226.10707194167213,{"$f":"K11/(1+Eingabe!N$37)^A11","v":200.77660919411935},-1479.3819019740604,7,7,null,6,{"$f":"Eingabe!N$30/100*(1+Eingabe!N$36)^Q10","v":7.7285656224000007E-2},{"$f":"Eingabe!$G$63*1/(1+Eingabe!N$33)^Q10","v":1160.6934821372131},238.03114461623213,{"$f":"Eingabe!$N$29/100*(1+Eingabe!$N$36)^Q11*S11*$G$45","v":225.81001629526082},12.221128320971312,{"$f":"Eingabe!G$32*(Eingabe!N$32)*(1+(Eingabe!N$35))^Berechnungen!Q10+IF(Eingabe!M31=\"viermal\",Eingabe!N31,0)","v":11.924072674560001},{"$f":"IF(AND(Eingabe!$I$36<=Berechnungen!Q11,(Eingabe!$I$36+Eingabe!$I$37)>Q11),(Eingabe!$G$34*(1-Eingabe!$G$36))/Eingabe!$I$37,0)","v":0},{"$f":"((Eingabe!$G$34*(1-Eingabe!$G$36))-SUM($X$5:X10))*Eingabe!$H$36","v":0},0,226.10707194167213,{"$f":"AA11/(1+Eingabe!N$37)^Q11","v":200.77660919411935},-1479.3819019740604,7,7]
[7,{"$f":"Eingabe!N$30/100*(1+Eingabe!N$36)^A11","v":7.8831369348480007E-2},{"$f":"Eingabe!$G$63/$F$38*$F$39*1/(1+Eingabe!N$33)^A11","v":1154.9188876987196},241.58384826722062,{"$f":"Eingabe!$N$29/100*(1+Eingabe!$N$36)^A12*C12*Berechnungen!$F$45","v":229.18031504593631},12.40353322128432,{"$f":"$F$61*(Eingabe!N$32)*(1+(Eingabe!N$35))^Berechnungen!A11+IF(Eingabe!M31=\"dreimal\",Eingabe!N31,0)","v":12.162554128051202},0,0,0,229.42129413916942,{"$f":"K12/(1+Eingabe!N$37)^A12","v":199.7250428036306},-1279.6568591704297,8,8,null,7,{"$f":"Eingabe!N$30/100*(1+Eingabe!N$36)^Q11","v":7.8831369348480007E-2},{"$f":"Eingabe!$G$63*1/(1+Eingabe!N$33)^Q11","v":1154.9188876987196},241.58384826722062,{"$f":"Eingabe!$N$29/100*(1+Eingabe!$N$36)^Q12*S12*$G$45","v":229.18031504593631},12.40353322128432,{"$f":"Eingabe!G$32*(Eingabe!N$32)*(1+(Eingabe!N$35))^Berechnungen!Q11+IF(Eingabe!M31=\"dreimal\",Eingabe!N31,0)","v":12.162554128051202},{"$f":"IF(AND(Eingabe!$I$36<=Berechnungen!Q12,(Eingabe!$I$36+Eingabe!$I$37)>Q12),(Eingabe!$G$34*(1-Eingabe!$G$36))/Eingabe!$I$37,0)","v":0},{"$f":"((Eingabe!$G$34*(1-Eingabe!$G$36))-SUM($X$5:X11))*Eingabe!$H$36","v":0},0,229.42129413916942,{"$f":"AA12/(1+Eingabe!N$37)^Q12","v":199.7250428036306},-1279.6568591704297,8,8]
[8,{"$f":"Eingabe!N$30/100*(1+Eingabe!N$36)^A12","v":8.0407996735449599E-2},{"$f":"Eingabe!$G$63/$F$38*$F$39*1/(1+Eingabe!N$33)^A12","v":1149.1730225857909},245.18957734583597,{"$f":"Eingabe!$N$29/100*(1+Eingabe!$N$36)^A13*C13*Berechnungen!$F$45","v":232.60091676303995},12.588660582796027,{"$f":"$F$61*(Eingabe!N$32)*(1+(Eingabe!N$35))^Berechnungen!A12","v":12.405805210612224},0,0,0,232.78377213522376,{"$f":"K13/(1+Eingabe!N$37)^A13","v":198.67870808672649},-1080.9781510837033,9,9,null,8,{"$f":"Eingabe!N$30/100*(1+Eingabe!N$36)^Q12","v":8.0407996735449599E-2},{"$f":"Eingabe!$G$63*1/(1+Eingabe!N$33)^Q12","v":1149.1730225857909},245.18957734583597,{"$f":"Eingabe!$N$29/100*(1+Eingabe!$N$36)^Q13*S13*$G$45","v":232.60091676303995},12.588660582796027,{"$f":"Eingabe!G$32*(Eingabe!N$32)*(1+(Eingabe!N$35))^Berechnungen!Q12","v":12.405805210612224},{"$f":"IF(AND(Eingabe!$I$36<=Berechnungen!Q13,(Eingabe!$I$36+Eingabe!$I$37)>Q13),(Eingabe!$G$34*(1-Eingabe!$G$36))/Eingabe!$I$37,0)","v":0},{"$f":"((Eingabe!$G$34*(1-Eingabe!$G$36))-SUM($X$5:X12))*Eingabe!$H$36","v":0},0,232.78377213522376,{"$f":"AA13/(1+Eingabe!N$37)^Q13","v":198.67870808672649},-1080.9781510837033,9,9]
[9,{"$f":"Eingabe!N$30/100*(1+Eingabe!N$36)^A13","v":8.2016156670158588E-2},{"$f":"Eingabe!$G$63/$F$38*$F$39*1/(1+Eingabe!N$33)^A13","v":1143.4557438664585},248.84912327637079,{"$f":"Eingabe!$N$29/100*(1+Eingabe!$N$36)^A14*C14*Berechnungen!$F$45","v":236.07257223711511},12.776551039255668,{"$f":"$F$61*(Eingabe!N$32)*(1+(Eingabe!N$35))^Berechnungen!A13","v":12.653921314824469},0,0,0,236.19520196154633,{"$f":"K14/(1+Eingabe!N$37)^A14","v":197.63757901517997},-883.34057206852333,10,10,null,9,{"$f":"Eingabe!N$30/100*(1+Eingabe!N$36)^Q13","v":8.2016156670158588E-2},{"$f":"Eingabe!$G$63*1/(1+Eingabe!N$33)^Q13","v":1143.4557438664585},248.84912327637079,{"$f":"Eingabe!$N$29/100*(1+Eingabe!$N$36)^Q14*S14*$G$45","v":236.07257223711511},12.776551039255668,{"$f":"Eingabe!G$32*(Eingabe!N$32)*(1+(Eingabe!N$35))^Berechnungen!Q13","v":12.653921314824469},{"$f":"IF(AND(Eingabe!$I$36<=Berechnungen!Q14,(Eingabe!$I$36+Eingabe!$I$37)>Q14),(Eingabe!$G$34*(1-Eingabe!$G$36))/Eingabe!$I$37,0)","v":0},{"$f":"((Eingabe!$G$34*(1-Eingabe!$G$36))-SUM($X$5:X13))*Eingabe!$H$36","v":0},0,236.19520196154633,{"$f":"AA14/(1+Eingabe!N$37)^Q14","v":197.63757901517997},-883.34057206852333,10,10]
[10,{"$f":"Eingabe!N$30/100*(1+Eingabe!N$36)^A14","v":8.3656479803561765E-2},{"$f":"Eingabe!$G$63/$F$38*$F$39*1/(1+Eingabe!N$33)^A14","v":1137.7669093198595},252.56328929542121,{"$f":"Eingabe!$N$29/100*(1+Eingabe!$N$36)^A15*C15*Berechnungen!$F$45","v":239.59604346453486},12.967245830886354,{"$f":"$F$61*(Eingabe!N$32)*(1+(Eingabe!N$35))^Berechnungen!A14+IF(Eingabe!M31=\"zweimal\",Eingabe!N31,0)","v":12.906999741120957},0,0,0,239.65628955430026,{"$f":"K15/(1+Eingabe!N$37)^A15","v":196.60162969025816},-686.73894237826516,11,11,null,10,{"$f":"Eingabe!N$30/100*(1+Eingabe!N$36)^Q14","v":8.3656479803561765E-2},{"$f":"Eingabe!$G$63*1/(1+Eingabe!N$33)^Q14","v":1137.7669093198595},252.56328929542121,{"$f":"Eingabe!$N$29/100*(1+Eingabe!$N$36)^Q15*S15*$G$45","v":239.59604346453486},12.967245830886354,{"$f":"Eingabe!G$32*(Eingabe!N$32)*(1+(Eingabe!N$35))^Berechnungen!Q14+IF(Eingabe!M31=\"zweimal\",Eingabe!N31,0)","v":12.906999741120957},{"$f":"IF(AND(Eingabe!$I$36<=Berechnungen!Q15,(Eingabe!$I$36+Eingabe!$I$37)>Q15),(Eingabe!$G$34*(1-Eingabe!$G$36))/Eingabe!$I$37,0)","v":0},{"$f":"((Eingabe!$G$34*(1-Eingabe!$G$36))-SUM($X$5:X14))*Eingabe!$H$36","v":0},0,239.65628955430026,{"$f":"AA15/(1+Eingabe!N$37)^Q15","v":196.60162969025816},-686.73894237826516,11,11]
{"$rows_left_out":70}
{"sheet":"Näherungsrechnung per Formel","index":2,"n_rows":30,"n_cols":20,"rows_kept":30,"cut":false,"hidden":true,"merged":[]}
[null,"Berechnung des Eigenverbrauchs von Gebäuden mit Photovoltaik und Wärmepumpe"]
[]
[null,null,"Eingaben",null,"AZ","kWh","Multiplikator","Offset","Modellgrenzen, mögl. Input",null,null,"Kommentar"]
[null,"Lastoptimierte Warmwasserbereitung und Heizung \"0 oder 1\"",null,{"$f":"INDEX(Berechnungen!D70:D74,MATCH(Eingabe!L21,Berechnungen!C70:C74,0))","v":0.5},null,null,null,null,"0 oder 1",null,null,null,"Eingabefelder",null,null,"Eingabefeld, holt sich Wert aus Blatt \"Eingabe\""]
[null,"Warmwasser","kWh/d/Pers","Personen",null,null,null,null,null,null,null,null,"geändert von Evi",null,null,"Holt sich Wert aus Blatt \"Berechnungen\""]
[null,null,{"$f":"Berechnungen!$F$83","v":2.5},{"$f":"+Eingabe!G21","v":3},{"$f":"Eingabe!$L$22","v":3},{"$f":"C6*D6*365/E6","v":912.5},{"$f":"F6/2","v":456.25},{"$f":"G6*$D$4","v":228.125},"1-10 Personen",null,null,"Halber WW Energiebedarf und zusätzl. Die andere Hälfte bei Lastoptimierung als Offset"]
[null,"Heizenergie","kWh/m^2","m^2"]
[null,null,{"$f":"+Eingabe!G23","v":30},{"$f":"+Eingabe!G22","v":140},{"$f":"+E6","v":3},{"$f":"C8*C10*D8/E8","v":2100},{"$f":"F8/8","v":262.5},{"$f":"G8*$D$4","v":131.25},"10-50 kWh/m^2a; 50-200m^2",null,null,"1/8 Des Heizenergiebedarf und zusätzlich noch 1/16 bzw. 1/8 als Offset bei Lastoptimierung"]
[null,null,"Faktor Heizgewohnheit","kWh",null,null,null,null,null,null,null,"Wert ist HWB lt. Energieausweis. Zuschlag von 50 oder 100 % je nach Heizgewohnheit"]
[null,null,{"$f":"INDEX(Berechnungen!H70:H74,MATCH(Eingabe!L23,Berechnungen!G70:G74,0))","v":1.5}]
[null,null,null,null,null,null,null,null,null,null,null,null,null,null,null,null,null,"erste 3,5 kWp","weiteres kWp"]
[null,"Haushaltsstrom",null,{"$f":"Eingabe!$G$24","v":4000},null,null,null,null,"500-8000",null,null,null,null,null,null,"Kosten / Kwp",null,{"$f":"+Eingabe!G29","v":2250},{"$f":"+Eingabe!G30","v":2000}]
[null,null,null,"kWh/kWp",null,null,null,null,null,null,null,null,null,null,null,"Eigenverbrauch Tarif",null,{"$f":"+Eingabe!G70","v":14.429194781209656},"welcher \"Tarif\" ist damit gemeint?"]
[null,"kWh/kWp",null,{"$f":"+Eingabe!G62","v":991.66870588235304},null,null,null,null,null,null,null,null,null,null,null,"Eispeisetarif",null,{"$f":"+Eingabe!N30","v":7}]
[null,null,null,null,null,null,null,null,null,null,null,null,null,null,null,"Jahre",null,25]
{"$rows_left_out":16}
{"sheet":"Ausrichtung","index":3,"n_rows":51,"n_cols":36,"rows_kept":51,"cut":false,"hidden":true,"merged":[[7,1,13,1],[23,1,29,1],[37,1,43,1]]}
[]
[null,null,null,null,null,null,null,null,null,null,null,null,null,null,null,null,null,null,null,null,null,null,null,null,null,null,null,null,null,null,null,null,{"$f":"HLOOKUP(AD13,D6:P7,2,TRUE)","v":8}]
[]
[null,null,null,null,null,null,null,null,null,null,null,null,null,null,null,null,null,null,null,null,null,null,null,null,null,null,"Neigung",78,{"$f":"C8","v":0},{"$f":"VLOOKUP(AB4,AC4:AC10,1)","v":75},"untere Grenze",{"$f":"AB4-AD4","v":3},{"$f":"VLOOKUP(AD5,C6:P14,AG2,TRUE)","v":65},null,null,{"$f":"HLOOKUP(AB4,C6:P14,3,TRUE)","v":85}]
[null,null,null,"Osten",null,null,null,null,null,"Azimut",null,null,null,null,null,"Westen",null,null,"Prozent",null,null,null,null,null,null,null,null,{"$f":"AB4","v":78},15,{"$f":"AD4+15","v":90},"obere Grenze",{"$f":"AD5-AB4","v":12},null,null,null,{"$f":"VLOOKUP(AB13,C6:P14,1,TRUE)","v":15}]
[null,null,null,-90,-75,-60,-45,-30,-15,0,15,30,45,60,75,90,null,null,55,null,null,null,null,null,null,null,null,78,30]
[null,null,null,1,2,3,4,5,6,7,8,9,10,11,12,13,null,null,65,null,null,null,null,null,null,null,null,78,45]
[null,"Neigung",0,85,85,85,85,85,85,85,85,85,85,85,85,85,null,null,75,null,null,null,null,null,null,null,null,78,60]
[null,null,15,85,85,85,95,95,95,95,95,95,95,85,85,85,null,null,85,null,null,null,null," ",null,null,null,78,75]
[null,null,30,85,85,85,95,95,95,100,95,95,95,85,85,85,null,null,95,null,null,null,null,null,null,null,null,78,90]
[null,null,45,75,85,85,85,95,95,95,95,95,85,85,85,75,null,null,100]
[null,null,60,75,75,75,85,85,85,85,85,85,85,75,75,75]
[null,null,75,65,65,75,75,75,75,75,75,75,75,75,65,65,null,null,null,null,null,null,null,null,null,null,"Azimut",20,-90,{"$f":"VLOOKUP(AB13,AC13:AC25,1)","v":15},"untere Grenze",{"$f":"AB13-AD13","v":5}]
[null,null,90,55,55,65,65,65,65,65,65,65,65,65,55,55,null,null,null,null,null,null,null,null,null,null,null,{"$f":"AB13","v":20},-75,{"$f":"AD13+15","v":30},"obere Grenze",{"$f":"AD14-AB13","v":10}]
[null,null,"Angaben in Prozent",null,null,null,null,null,null,null,null,null,null,null,null,null,null,null,null,null,null,null,null,null,null,null,null,{"$f":"AB14","v":20},-60]
{"$rows_left_out":37}
{"sheet":"Wetterdaten","index":4,"n_rows":54,"n_cols":13,"rows_kept":54,"cut":false,"hidden":true,"merged":[]}
["Ort","PLZ","Land","PLZ-Differenz","Jährliche Einstrahlung","mittlere Aussentemperatur","Längengrad","Breitengrad","Ermittlung der Einstrahlung"]
[null,null,null,null,"[kWh/m²a]","[°C]","[°]","[°]"]
["Admont",8911,"AUT",{"$f":"IF(B3>$L$3,B3-$L$3,$L$3-B3)","v":7781},1028.32,"    5.86","-14.45"," 47.57",{"$f":"IF($L$4=D3,E3,0)","v":0},{"$f":"IF(I3=0,0,1)","v":0},"PLZ:",{"$f":"Eingabe!D11","v":1130}]
["Amstetten",3300,"AUT",{"$f":"IF(B4>$L$3,B4-$L$3,$L$3-B4)","v":2170},1069.0999999999999,"    8.79","-14.83"," 48.08",0,{"$f":"IF(I4=0,0,1)","v":0},"Diff:",{"$f":"MIN(D3:D53)","v":60}]
["Arriach",9543,"AUT",{"$f":"IF(B5>$L$3,B5-$L$3,$L$3-B5)","v":8413},1144.54,"    6.46","-13.85"," 46.72",0,0,"Einstrahlung",{"$f":"ROUNDDOWN(K54,-0.5)","v":1084},"kWh/m²a"]
["Bad Gleichenberg",8344,"AUT",7214,1153.19,"    9.14","-15.88"," 46.87",0,0]
["Bad Ischl",4820,"AUT",3690,1093.31,"    7.90","-13.60"," 47.72",0,0]
["Bludenz",6700,"AUT",{"$f":"IF(B8>$L$3,B8-$L$3,$L$3-B8)","v":5570},1079.79,"    7.97"," -9.82"," 48.50",0,0]
["Bruck an der Mur",8600,"AUT",7470,1070.77,"    8.07","-15.25"," 47.42",0,0]
["Eisenerz",8790,"AUT",7660,1071.43,"    7.11","-14.88"," 47.53",0,0]
["Eisenstadt",7000,"AUT",{"$f":"IF(B11>$L$3,B11-$L$3,$L$3-B11)","v":5870},1132.17,"   10.01","-16.68"," 47.90",0,0]
["Feldkirch",6800,"AUT",5670,1100.3800000000001,"    8.30"," -9.58"," 47.23",0,0]
["Ferlach",9170,"AUT",8040,1156.25,"    7.82","-14.28"," 46.52",0,0]
["Fresach ",9712,"AUT",8582,1207.3599999999999,"    7.07","-13.68"," 46.70",0,0]
["Gargellen",6787,"AUT",5657,1174.51,"    4.42"," -9.92"," 46.97",0,0]
{"$rows_left_out":40}
{"sheet":"PLZ-Zuordnung","index":5,"n_rows":2460,"n_cols":10,"rows_kept":2460,"cut":false,"hidden":true,"merged":[]}
["PLZ","Ort","Bundesland","NamePLZTyp","intern_extern","adressierbar","Postfach"]
[null,null,null,null,null,null,null,null,"Zuordnung der PLZ und des Ortes (Bundesland):"]
[1004,"Wien","W","InteressentenPLZ","extern","Nein","Ja",null,{"$f":"Eingabe!D11","v":1130},{"$f":"VLOOKUP(I3,A3:C2460,3,TRUE)","v":"W"}]
[1010,"Wien","W","PLZ-Adressierung","extern","Ja","Ja",null,null,{"$f":"VLOOKUP(J3,I7:J15,2,TRUE)","v":"Wien"}]
[1011,"Wien Postfach","W","PLZ-Postfach","extern","Nein","Ja",null,null,{"$f":"VLOOKUP(I3,A3:C2460,2,FALSE)","v":"Wien"}]
[1012,"Wien","W","PLZ-Postfach","extern","Nein","Ja"]
[1013,"Wien","W","PLZ-Postfach","extern","Nein","Ja",null,"B","Burgenland"]
[1014,"Wien","W","PLZ-Postfach","extern","Nein","Ja",null,"K","Kärnten"]
[1015,"Wien","W","PLZ-Postfach","extern","Nein","Ja",null,"N","Niederösterreich"]
[1016,"Wien","W","PLZ-Postfach","extern","Nein","Ja",null,"O","Oberösterreich"]
[1017,"Wien-Parlament","W","PLZ-Postfach","extern","Nein","Ja",null,"Sa","Salzburg"]
[1018,"Wien","W","PLZ-Postfach","extern","Nein","Ja",null,"St","Steiermark"]
[1020,"Wien","W","PLZ-Adressierung","extern","Ja","Ja",null,"T","Tirol"]
[1021,"Wien Postfach","W","PLZ-Postfach","extern","Nein","Ja",null,"V","Vorarlberg"]
[1022,"Wien","W","PLZ-Postfach","extern","Nein","Ja",null,"W","Wien"]
{"$rows_left_out":2445}